{"text_format":"3","workbook":"xlsx","n_sheets":7,"sheets":["2023年实习计划--燕化","Sheet1","2023年实习计划--其他","2023年教培中心实训课程明细","2023年燕化实习装置分布情况","22-23春教学进程","基础数据"],"not_rendered":{"defined_names":11},"read":"whole","date_system":"1900"}

{"sheet":"2023年实习计划--燕化","index":0,"n_rows":1509,"n_cols":23,"rows_kept":1509,"merged":[[0,0,0,22],[1,0,1,22]]}
["北京石油化工学院2023年度实习计划表---燕化实习              "]
["1、请各位老师在绿色区域直接选择下拉菜单中的选项，无需手动输入\n2、请各位老师在填写“实习起始/终止时间”两列时，按2023/12/06格式输入日期"]
["序号","学期","院系","专业","班级","实践环节课程名称",null,"课程号","总周数","周次","学生男","学生女","学生人数","教师男","教师女","实习起始时间","实习终止时间","实习场所","实训课程/实习单位","实习内容与要求","带队教师姓名、联系方式、邮箱","经费预算","说明或备用方案"]
["示例","2023春","新材料与化工学院","化学工程与工艺","化18-123","生产实习",{"$f":"C4&F4","v":"新材料与化工学院生产实习"},{"$f":"VLOOKUP(G4,Sheet1!C:D,2,FALSE)","v":"CHE314"},3,"17-19周",43,28,71,1,1,"2023-06-13","2023-07-01","教培实训课程","炼油系统仿真操作"]
["示例","2023春","安全工程学院","安全工程","安181","专业实习",{"$f":"C5&F5","v":"安全工程学院专业实习"},{"$f":"VLOOKUP(G5,Sheet1!C:D,2,FALSE)","v":"SAE401"},1,"18周",13,14,27,1,1,"2023-06-20","2023-06-24","教培实训课程","热工（CFB炉）仿真操作"]
[{"$nulls":7},{"$f":"VLOOKUP(G6,Sheet1!C:D,2,FALSE)","v":{"$error":"#N/A"}}]
[{"$nulls":7},{"$f":"VLOOKUP(G7,Sheet1!C:D,2,FALSE)","v":{"$error":"#N/A"}}]
[{"$nulls":6},"",{"$f":"VLOOKUP(G8,Sheet1!C:D,2,FALSE)","v":{"$error":"#N/A"}}]
[{"$nulls":6},"",{"$f":"VLOOKUP(G9,Sheet1!C:D,2,FALSE)","v":{"$error":"#N/A"}}]
[{"$nulls":6},"",{"$f":"VLOOKUP(G10,Sheet1!C:D,2,FALSE)","v":{"$error":"#N/A"}}]
[{"$nulls":6},"",{"$f":"VLOOKUP(G11,Sheet1!C:D,2,FALSE)","v":{"$error":"#N/A"}}]
[{"$nulls":6},"",{"$f":"VLOOKUP(G12,Sheet1!C:D,2,FALSE)","v":{"$error":"#N/A"}}]
[{"$nulls":6},"",{"$f":"VLOOKUP(G13,Sheet1!C:D,2,FALSE)","v":{"$error":"#N/A"}}]
[{"$nulls":6},"",{"$f":"VLOOKUP(G14,Sheet1!C:D,2,FALSE)","v":{"$error":"#N/A"}}]
[{"$nulls":6},"",{"$f":"VLOOKUP(G15,Sheet1!C:D,2,FALSE)","v":{"$error":"#N/A"}}]
[{"$nulls":6},"",{"$f":"VLOOKUP(G16,Sheet1!C:D,2,FALSE)","v":{"$error":"#N/A"}}]
[{"$nulls":6},"",{"$f":"VLOOKUP(G17,Sheet1!C:D,2,FALSE)","v":{"$error":"#N/A"}}]
[{"$nulls":6},"",{"$f":"VLOOKUP(G18,Sheet1!C:D,2,FALSE)","v":{"$error":"#N/A"}}]
[{"$nulls":6},"",{"$f":"VLOOKUP(G19,Sheet1!C:D,2,FALSE)","v":{"$error":"#N/A"}}]
[{"$nulls":6},"",{"$f":"VLOOKUP(G20,Sheet1!C:D,2,FALSE)","v":{"$error":"#N/A"}}]
[{"$nulls":6},"",{"$f":"VLOOKUP(G21,Sheet1!C:D,2,FALSE)","v":{"$error":"#N/A"}}]
[{"$nulls":6},"",{"$f":"VLOOKUP(G22,Sheet1!C:D,2,FALSE)","v":{"$error":"#N/A"}}]
[{"$nulls":6},"",{"$f":"VLOOKUP(G23,Sheet1!C:D,2,FALSE)","v":{"$error":"#N/A"}}]
[{"$nulls":6},"",{"$f":"VLOOKUP(G24,Sheet1!C:D,2,FALSE)","v":{"$error":"#N/A"}}]
[{"$nulls":6},"",{"$f":"VLOOKUP(G25,Sheet1!C:D,2,FALSE)","v":{"$error":"#N/A"}}]
[{"$nulls":6},"",{"$f":"VLOOKUP(G26,Sheet1!C:D,2,FALSE)","v":{"$error":"#N/A"}}]
[null,null,"化学工程学院",{"$nulls":3},"化学工程学院",{"$f":"VLOOKUP(G27,Sheet1!C:D,2,FALSE)","v":{"$error":"#N/A"}}]
[{"$nulls":6},"",{"$f":"VLOOKUP(G28,Sheet1!C:D,2,FALSE)","v":{"$error":"#N/A"}}]
[{"$nulls":6},"",{"$f":"VLOOKUP(G29,Sheet1!C:D,2,FALSE)","v":{"$error":"#N/A"}}]
[{"$nulls":6},"",{"$f":"VLOOKUP(G30,Sheet1!C:D,2,FALSE)","v":{"$error":"#N/A"}}]
[{"$nulls":6},"",{"$f":"VLOOKUP(G31,Sheet1!C:D,2,FALSE)","v":{"$error":"#N/A"}}]
[{"$nulls":6},"",{"$f":"VLOOKUP(G32,Sheet1!C:D,2,FALSE)","v":{"$error":"#N/A"}}]
[{"$nulls":6},"",{"$f":"VLOOKUP(G33,Sheet1!C:D,2,FALSE)","v":{"$error":"#N/A"}}]
[{"$nulls":6},"",{"$f":"VLOOKUP(G34,Sheet1!C:D,2,FALSE)","v":{"$error":"#N/A"}}]
[{"$nulls":6},"",{"$f":"VLOOKUP(G35,Sheet1!C:D,2,FALSE)","v":{"$error":"#N/A"}}]
[{"$nulls":6},"",{"$f":"VLOOKUP(G36,Sheet1!C:D,2,FALSE)","v":{"$error":"#N/A"}}]
[{"$nulls":6},"",{"$f":"VLOOKUP(G37,Sheet1!C:D,2,FALSE)","v":{"$error":"#N/A"}}]
[{"$nulls":6},"",{"$f":"VLOOKUP(G38,Sheet1!C:D,2,FALSE)","v":{"$error":"#N/A"}}]
[{"$nulls":6},"",{"$f":"VLOOKUP(G39,Sheet1!C:D,2,FALSE)","v":{"$error":"#N/A"}}]
[{"$nulls":6},"",{"$f":"VLOOKUP(G40,Sheet1!C:D,2,FALSE)","v":{"$error":"#N/A"}}]
{"$rows_left_out":1470}
{"sheet":"Sheet1","index":1,"n_rows":323,"n_cols":7,"rows_kept":323,"hidden":true,"merged":[[0,0,1,0],[0,1,1,1],[0,3,1,3],[0,4,1,4],[0,5,1,5],[0,6,1,6]]}
["开课学年学期","开课院系",null,"课程号","课程名称","课程性质","专业"]
[]
["2022秋","经济管理学院",{"$f":"B3&E3","v":"经济管理学院科学研究训练"},"04P3292","科学研究训练","实践环节","会计学"]
["2022秋","经济管理学院",{"$f":"B4&E4","v":"经济管理学院专业认识实习"},"ACC205","专业认识实习","实践环节","会计学(国际会计师方向)"]
["2022秋","经济管理学院","经济管理学院专业认识实习","ACC205","专业认识实习","实践环节","会计学"]
["2022秋","经济管理学院","经济管理学院涉税实务","ACC206","涉税实务","实践环节","会计学(国际会计师方向)"]
["2022秋","经济管理学院","经济管理学院涉税实务","ACC206","涉税实务","实践环节","会计学"]
["2022秋","经济管理学院","经济管理学院财务管理沙盘模拟实习","ACC306","财务管理沙盘模拟实习","实践环节","会计学"]
["2022秋","经济管理学院","经济管理学院科学研究训练","ACC401","科学研究训练","实践环节","会计学(国际会计师方向)"]
["2022秋","经济管理学院","经济管理学院科学研究训练","ACC401","科学研究训练","实践环节","会计学"]
["2022秋","经济管理学院","经济管理学院综合实习","ACC402","综合实习","实践环节","会计学(国际会计师方向)"]
["2022秋","经济管理学院","经济管理学院综合实习","ACC402","综合实习","实践环节","会计学"]
["2022秋","经济管理学院","经济管理学院科学研究训练","IET403","科学研究训练","实践环节","国际经济与贸易"]
["2022秋","经济管理学院","经济管理学院科学研究训练","IET403","科学研究训练","实践环节","国际经济与贸易"]
["2022秋","经济管理学院","经济管理学院专业综合实习","IET405","专业综合实习","实践环节","国际经济与贸易"]
["2022秋","经济管理学院","经济管理学院经济学研究方法实践","IET404","经济学研究方法实践","实践环节","国际经济与贸易"]
["2022秋","经济管理学院","经济管理学院国际贸易业务模拟实习","IET401","国际贸易业务模拟实习","实践环节","国际经济与贸易"]
["2022秋","经济管理学院","经济管理学院国际贸易业务模拟实习","IET401","国际贸易业务模拟实习","实践环节","国际经济与贸易"]
["2022秋","经济管理学院","经济管理学院商业银行业务模拟实习","IET402","商业银行业务模拟实习","实践环节","国际经济与贸易"]
["2022秋","经济管理学院","经济管理学院商业银行业务模拟实习","IET402","商业银行业务模拟实习","实践环节","国际经济与贸易"]
["2022秋","信息工程学院","信息工程学院计算机组成原理课程设计","CST304","计算机组成原理课程设计","实践环节","计算机科学与技术"]
["2022秋","信息工程学院","信息工程学院计算机网络课程设计","CST305","计算机网络课程设计","实践环节","计算机科学与技术"]
["2022秋","信息工程学院","信息工程学院计算机专业实习","CST318","计算机专业实习","实践环节","计算机科学与技术"]
["2022秋","信息工程学院","信息工程学院计算机应用系统综合设计","CST405","计算机应用系统综合设计","实践环节","计算机科学与技术"]
["2022秋","新材料与化工学院","新材料与化工学院认识实习","CHE202","认识实习","实践环节","化学工程与工艺"]
["2022秋","新材料与化工学院","新材料与化工学院生产实习","CHE314","生产实习","实践环节","化学工程与工艺"]
["2022秋","机械工程学院","机械工程学院计算机辅助设计与工程图学训练","CEG202","计算机辅助设计与工程图学训练","实践环节","机械电子工程"]
["2022秋","新材料与化工学院","新材料与化工学院认识实习","MSE320","认识实习","实践环节","材料科学与工程"]
["2022秋","经济管理学院","经济管理学院物流管理工具实习","LOM315","物流管理工具实习","实践环节","物流管理"]
["2022秋","人文社科学院","人文社科学院会展专业实习","EEM401","会展专业实习","实践环节","会展经济与管理"]
["2022秋","人文社科学院","人文社科学院旅游专业实习","TRM401","旅游专业实习","实践环节","旅游管理"]
["2022秋","人文社科学院","人文社科学院旅游专业实习","TRM401","旅游专业实习","实践环节","旅游管理"]
["2022秋","信息工程学院","信息工程学院电子工程设计B","EEE210","电子工程设计B","实践环节","数据科学与大数据技术"]
["2022秋","信息工程学院","信息工程学院电子工程设计B","EEE210","电子工程设计B","实践环节","计算机科学与技术"]
["2022秋","新材料与化工学院","新材料与化工学院暑期工程实践（Ⅱ）","MSE325","暑期工程实践（Ⅱ）","实践环节","材料科学与工程"]
["2022秋","信息工程学院","信息工程学院大数据应用系统综合设计","BDT401","大数据应用系统综合设计","实践环节","数据科学与大数据技术"]
["2022秋","机械工程学院","机械工程学院专业实习(一)","PETP321","专业实习(一)","实践环节","油气储运工程"]
["2022秋","工程师学院","工程师学院工程训练C","EEC103","工程训练C","实践环节","材料科学与工程"]
["2022秋","工程师学院","工程师学院工程训练C","EEC103","工程训练C","实践环节","高分子材料与工程"]
["2022秋","工程师学院","工程师学院工程训练C","EEC103","工程训练C","实践环节","数据科学与大数据技术(中法班)"]
{"$rows_left_out":284}
{"sheet":"2023年实习计划--其他","index":2,"n_rows":1303,"n_cols":23,"rows_kept":1303,"merged":[[0,0,0,22],[1,0,1,22]]}
["北京石油化工学院2023年度实习计划表---其他实习(非燕化实习均填此表）"]
["1、请各位老师在绿色区域直接选择下拉菜单中的选项，无需手动输入\n2、请各位老师在填写“实习起始/终止时间”两列时，按2023/12/06格式输入日期"]
["序号","学期","院系","专业","班级","实践环节课程名称",null,"课程号","总周数","周次","学生男","学生女","学生人数","教师男","教师女","实习起始时间","实习终止时间","实习类型","实习单位名称/场所","实习目的、内容与要求","带队教师姓名、联系方式、邮箱","经费预算","说明或备用方案"]
["示例","2023秋","新材料与化工学院","化学工程与工艺","化18-123","认识实习",{"$f":"C4&F4","v":"新材料与化工学院认识实习"},{"$f":"VLOOKUP(G4,Sheet1!C:D,2,FALSE)","v":"CHE202"},3,"17-19周",43,28,71,1,1,"2023-06-13","2023-07-01","校内"]
[null,"2022秋","机械工程学院","环境工程",{"$nulls":3},{"$f":"VLOOKUP(G5,Sheet1!C:D,2,FALSE)","v":{"$error":"#N/A"}}]
[{"$nulls":6},{"$f":"C6&F6","v":""},{"$f":"VLOOKUP(G6,Sheet1!C:D,2,FALSE)","v":{"$error":"#N/A"}}]
[{"$nulls":6},"",{"$f":"VLOOKUP(G7,Sheet1!C:D,2,FALSE)","v":{"$error":"#N/A"}}]
[{"$nulls":6},"",{"$f":"VLOOKUP(G8,Sheet1!C:D,2,FALSE)","v":{"$error":"#N/A"}}]
[{"$nulls":6},"",{"$f":"VLOOKUP(G9,Sheet1!C:D,2,FALSE)","v":{"$error":"#N/A"}}]
[{"$nulls":6},"",{"$f":"VLOOKUP(G10,Sheet1!C:D,2,FALSE)","v":{"$error":"#N/A"}}]
[{"$nulls":6},"",{"$f":"VLOOKUP(G11,Sheet1!C:D,2,FALSE)","v":{"$error":"#N/A"}}]
[{"$nulls":6},"",{"$f":"VLOOKUP(G12,Sheet1!C:D,2,FALSE)","v":{"$error":"#N/A"}}]
[{"$nulls":6},"",{"$f":"VLOOKUP(G13,Sheet1!C:D,2,FALSE)","v":{"$error":"#N/A"}}]
[{"$nulls":6},"",{"$f":"VLOOKUP(G14,Sheet1!C:D,2,FALSE)","v":{"$error":"#N/A"}}]
[{"$nulls":6},"",{"$f":"VLOOKUP(G15,Sheet1!C:D,2,FALSE)","v":{"$error":"#N/A"}}]
[{"$nulls":6},"",{"$f":"VLOOKUP(G16,Sheet1!C:D,2,FALSE)","v":{"$error":"#N/A"}}]
[{"$nulls":6},"",{"$f":"VLOOKUP(G17,Sheet1!C:D,2,FALSE)","v":{"$error":"#N/A"}}]
[{"$nulls":6},"",{"$f":"VLOOKUP(G18,Sheet1!C:D,2,FALSE)","v":{"$error":"#N/A"}}]
[{"$nulls":6},"",{"$f":"VLOOKUP(G19,Sheet1!C:D,2,FALSE)","v":{"$error":"#N/A"}}]
[{"$nulls":6},"",{"$f":"VLOOKUP(G20,Sheet1!C:D,2,FALSE)","v":{"$error":"#N/A"}}]
[{"$nulls":6},"",{"$f":"VLOOKUP(G21,Sheet1!C:D,2,FALSE)","v":{"$error":"#N/A"}}]
[{"$nulls":6},"",{"$f":"VLOOKUP(G22,Sheet1!C:D,2,FALSE)","v":{"$error":"#N/A"}}]
[{"$nulls":6},"",{"$f":"VLOOKUP(G23,Sheet1!C:D,2,FALSE)","v":{"$error":"#N/A"}}]
[{"$nulls":6},"",{"$f":"VLOOKUP(G24,Sheet1!C:D,2,FALSE)","v":{"$error":"#N/A"}}]
[{"$nulls":6},"",{"$f":"VLOOKUP(G25,Sheet1!C:D,2,FALSE)","v":{"$error":"#N/A"}}]
[{"$nulls":6},"",{"$f":"VLOOKUP(G26,Sheet1!C:D,2,FALSE)","v":{"$error":"#N/A"}}]
[{"$nulls":6},"",{"$f":"VLOOKUP(G27,Sheet1!C:D,2,FALSE)","v":{"$error":"#N/A"}}]
[null,null,"化学工程学院",{"$nulls":3},"化学工程学院",{"$f":"VLOOKUP(G28,Sheet1!C:D,2,FALSE)","v":{"$error":"#N/A"}}]
[{"$nulls":6},"",{"$f":"VLOOKUP(G29,Sheet1!C:D,2,FALSE)","v":{"$error":"#N/A"}}]
[{"$nulls":6},"",{"$f":"VLOOKUP(G30,Sheet1!C:D,2,FALSE)","v":{"$error":"#N/A"}}]
[{"$nulls":6},"",{"$f":"VLOOKUP(G31,Sheet1!C:D,2,FALSE)","v":{"$error":"#N/A"}}]
[{"$nulls":6},"",{"$f":"VLOOKUP(G32,Sheet1!C:D,2,FALSE)","v":{"$error":"#N/A"}}]
[{"$nulls":6},"",{"$f":"VLOOKUP(G33,Sheet1!C:D,2,FALSE)","v":{"$error":"#N/A"}}]
[{"$nulls":6},"",{"$f":"VLOOKUP(G34,Sheet1!C:D,2,FALSE)","v":{"$error":"#N/A"}}]
[{"$nulls":6},"",{"$f":"VLOOKUP(G35,Sheet1!C:D,2,FALSE)","v":{"$error":"#N/A"}}]
[{"$nulls":6},"",{"$f":"VLOOKUP(G36,Sheet1!C:D,2,FALSE)","v":{"$error":"#N/A"}}]
[{"$nulls":6},"",{"$f":"VLOOKUP(G37,Sheet1!C:D,2,FALSE)","v":{"$error":"#N/A"}}]
[{"$nulls":6},"",{"$f":"VLOOKUP(G38,Sheet1!C:D,2,FALSE)","v":{"$error":"#N/A"}}]
[{"$nulls":6},"",{"$f":"VLOOKUP(G39,Sheet1!C:D,2,FALSE)","v":{"$error":"#N/A"}}]
[{"$nulls":6},"",{"$f":"VLOOKUP(G40,Sheet1!C:D,2,FALSE)","v":{"$error":"#N/A"}}]
{"$rows_left_out":1264}
{"sheet":"2023年教培中心实训课程明细","index":3,"n_rows":34,"n_cols":9,"rows_kept":34,"merged":[[0,0,0,8],[2,7,6,7],[2,8,6,8],[3,6,6,6],[7,7,17,7],[7,8,17,8],[15,6,17,6],[18,6,21,6],[18,7,33,7],[18,8,33,8],[23,6,31,6],[32,6,33,6]]}
["燕山石化教育培训中心学生实训课程明细（2023）"]
["序号","实训课程名称","实训目的","主要内容","课时","人数","实习场所","承接部门","负责人"]
[1,"炼油化工装置基本操作技能","1.通过训练装置实习,熟悉对二甲苯装置的生产工艺流程，掌握化工基本操作技能和化工单元操作，学会装置开停工操作，增强工程实践能力。\n⒉培养学生良好职业素养和职业道德，成为具有一定工程实践能力、良好的沟通能力和团队合作精神的化工技术人才。\n","1.安全帽、安全带的使用方法\n2. 训练装置工艺流程图的识读；\n3. 离心泵的工作原理、操作及日常维护；\n4. DCS的基本功能；\n5.加热炉、精馏塔等典型设备的控制方案；\n6.训练装置的开停车；\n7. 正常巡检及工艺台帐记录；\n8. 常见故障的处理方法",40,30,"教育培训中心西校区石油化工训练装置","\n\n\n炼化仿真培训部","\n\n\n祝子强\n69338654\n13691137372\n\n"]
[2,"炼油系统仿真操作","以炼油系统常减压装置为例：\n1.熟悉常减压装置的各项工艺参数；\n2.学会常减压工艺的开车步骤、DCS操作方法、生产操作的调节手段；\n3.熟悉设备的正常使用、仪表控制等的操作方法；\n4.熟悉常减压整个生产流程。\n","1. 原油的评价及由来\n2.换热器的原理、结构和日常操作\n3. 电脱盐的原理、结构和日常注意问题\n4. 塔的操作和基本生产原理\n5. 加热炉的原理、结构及操作\n6.产品质量的调节\n7. 炼油厂安全事例分析\n8.环保、腐蚀对装置的影响\n9.常减压开停车方案及事故处理原则\n10.仪表的基本知识\n11. Dcs基础知识和操作\n12.各类常用设备的原理和结构及操作方法。",40,30,"教育培训中心西校区仿真培训室"]
[3,"化工系统仿真操作","以化工系统聚乙烯装置为例：\n1.熟悉聚乙烯装置的各项工艺参数；\n2.了解聚乙烯装置的工艺特点、开车步骤、DCS操作方法、生产操作的调节手段；\n3.熟悉设备的正常使用、仪表控制等的操作方法；\n4.了解聚乙烯生产操作的生产过程。","1.介绍生产工艺流程、工艺控制；\n2.仿真操作画面讲解及开车操作演练；\n3.聚乙烯仿真开车训练。",40,30]
[4,"热工（CFB炉）仿真操作","1.通过对CFB锅炉的工艺过程、操作原理、设备知识等方面的培训， 使参训人员了解CFB锅炉的生产过程、工艺原理，掌握设备及仪表控制等基本理论知识；\n2.通过进行CFB锅炉仿真操作培训，使参训人员熟悉CFB锅炉的各项工艺参数，熟练掌握CFB锅炉的开停车步骤、DCS操作方法、生产操作的调节手段，以及熟悉设备的正常使用、仪表控制等的操作方法，以提高参训人员的生产操作能力；\n3.掌握CFB锅炉操作的基本操作方法和基本控制方案。","1.介绍生产工艺流程、工艺控制；\n2.仿真操作画面讲解及开车操作演练；\n3.CFB锅炉仿真开车训练。\n",40,30]
[5,"高分子专业工程教育认证","1.熟悉聚丙烯装置的各项工艺参数；\n了解聚丙烯工艺的开车步骤、DCS操作方法、生产操作的调节手段；\n2.熟悉设备的正常使用、仪表控制等的操作方法；\n3.了解聚丙烯生产操作的生产过程；\n4.依据中国工程教育专业认证标准, 通过仿真实习达到能解决复杂工艺问题的毕业要求，提高学生的知识与技能素养。","1.介绍生产工艺流程、工艺控制；\n2.仿真操作画面讲解及开车操作演练；\n3. 聚丙烯仿真开车训练；\n4.分组研讨－复杂工艺问题解决方案。会运用深入的工程原理分析解决部分复杂工艺问题。\n",120,30]
[6,"机泵拆装（过装专业）","通过四种机泵的拆装，掌握其结构、工作原理，了解各零部件的作用和零件的常用材料，配合间隙的调整及检测、检修方法；另通过实训掌握开停车的过程，常见故障现象；测量、绘制常见零件的图纸。","往复式压缩机、计量泵、磁力泵、三级水泵的工作原理、结构及拆装方法。",48,30,"教育培训中心机泵检维修实训基地","\n\n\n\n\n机电仪培训部","\n\n\n\n祝子强\n69338654\n13691137372\n"]
[7,"常规仪表应用培训","认识各类仪表；认识控制系统的构成；培养学生对仪表自控的工程应用能力。","回路调试；仪表校验；简单故障分析处理",40,20,"教育培训中心西校区常规表实训室"]
[8,"西门子PLC（S7-300）应用培训","认识S7-300软硬件；学会组态；了解西门子PLC的工程应用","S7-300软硬件；组态；以任务为中心学习西门子PLC的工程应用",40,20,"教育培训中心西校区PLC（S7-300）实训室"]
[9,"横河DCS（CS3000）应用培训","认识CS3000系统软硬件；学会组态；了解CS3000的工程应用内容","CS3000软硬件；组态基础；系统应用与维护",40,20,"教育培训中心西校区横河DCS（CS3000）实训室"]
[10,"ECS700应用培训","认识ECS700系统软硬件；学会组态；了解ECS700的工程应用内容","ECS700软硬件；组态基础；系统应用与维护",40,20,"教育培训中心西校区横河DCS（ECS700）实训室"]
[11,"6kV变电站运行及相关技术","了解6kV变电站的系统组成，了解变电站运行的相关规程，了解基本的倒闸操作方法。","电力系统简介，倒闸操作规范，倒闸操作实操",20,20,"教育培训中心西校区6kV综合自动化变电站实训室"]
[12,"高压异步电动机二次回路故障查找","掌握基本的识图方法，了解二次回路的工作原理，掌握基本的故障排查方法。","二次回路原理及组成，故障排查实操",20,20,"教育培训中心西校区二次回路实训室"]
[13,"欧姆龙PLC技术","了解PLC的原理，会使用编程软件编写简单的控制程序，外部接线和程序调试。                          ","PLC简介，编程软件，编程方法及调试",20,20,"教育培训中心西校区欧姆龙PLC实训室"]
[14,"人体触电的相关知识、配电系统设备参观 ","了解人体触电的相关知识、了解常用电气设备                                          ","人体触电的相关知识、常用电气设备介绍",4,20,"教育培训中心西校区电气实训室"]
[15,"电气法律法规、安全用电                                 ","了解安全生产法、北京市安全生产条例                                                            了解电工特种作业管理标准                                    掌握安全用电的常识","安全生产法、北京市安全生产条例                                                            电工特种作业管理标准                                    安全用电的常识",4,20]
[16,"电气安全工作规程","了解电气安全工作的组织措施和技术措施                                                            了解防雷和防静电技术                                了解电气防火技术","电气安全工作的组织措施和技术措施                                                            防雷和防静电技术                                电气防火技术",4,20]
[17,"危化品工艺单元事故处理及应急处置","通过培训，学员能够了解不同工艺单元在发生异常状况或事故时的处理过程及处置要求","熟悉工艺过程、发现问题并及时处理",16,"≤45","危化品培训基地","安全环保培训部","徐建华80344961、13621020856"]
[18,"直接作业仿真操作培训","通过培训，学员能够了解并掌握直接作业过程的特点、隐患排查及安全监护的相关要求","熟悉作业任务、危害识别与隐患排除、安全措施检查与落实、开始作业",16,"≤45"]
[19,"加氢裂化装置（炼油）认识实习学习系统","该系统的三维模型是按燕山石化加氢裂化装置真实场景开发而成。学生通过学习装置的知识点、回答思考题、完成任务，可掌握生产的HSE、工艺生产、设备、应急处理等方面知识。系统可自动评分。","加氢裂化装置仿真操作训练",16,"≤45"]
[20,"初起火灾救援及灭火器的选择与使用","会判断不同类型的初起火灾，会选择使用灭火器材。","初起火灾扑救（理论）、灭火器的使用",4,30]
[21,"空气呼吸器选择与佩戴","会针对不同危险环境选择和正确佩戴空气呼吸器，能发现空气呼吸器存在的安全隐患，会进行判断其安全性。","空气呼吸器的选择、检查与佩戴",4,30,"危化品培训基地、安全实训基地"]
[22,"消防基础与事故案例","知道石油化工企业着火爆炸的机理，知道如何进行防火与防爆，会正确选择和使用灭火器","防火防爆理论、灭火器的选择与使用操作方法",4,30,"安全实训基地"]
[23,"进入受限空间操作","知道进入受限空间安全操作内容，会操作。","进入受限空间进行安全操作讲解",4,30]
[24,"事故模拟安全演习","通过装置模拟演练，知道如何进行正确处置和组织救援及相应的应急； 知道企业安全工作人员应当扮演的角色及其工作内容。","安全基地装置，以小组为单位进行情景分析和事故模拟演练",4,30]
[25,"结绳操作技能","掌握结绳操作技能，针对事故现场能自救互救。","结绳操作技能",2,30]
[26,"隐患排查及事故现场应急处置","针对石油化工企业常出现的事故，知道如何进行装置的隐患排查，正确处置和组织救援及相应的应急。","石油化工企业常出现的事故案例，装置的隐患排查的操作方法等",8,30]
[27,"安全展板学习及考核","知识安全生产法规、制度的基本要求，会区分哪些是不安全行为，哪些是还不安全状态，知道如何防范事故","安全生产法规、制度要求、不安全行为和不安全状态识别与考核",4,30]
[28,"火灾逃生与事故应急","知道发生火灾时的正确应对措施，会针对火灾现场如何应对初期火灾","火灾应急演练、演练出现的问题点评",4,30]
[29,"石油化工作业流程介绍与事故案例","知道石油化工系统的作业流程，各阶段的主要内容，了解各作业过程中的事故发生原因与防范措施","石油化工上、中、下游作业流程介绍与石油化工事故案例",4,30]
[30,"安全设备设施与个体防护用品","会结合现场的危险有害因素选择适宜的个人防护用品，并会正确使用，会判断异常","常用个人防护用品的种类，适用的场合，使用方法",4,30]
[31,"现场创伤救护技术","能够掌握事故现场的止血包扎及伤员搬运操作技能，并会自救互救。","止血包扎操作技能和伤员搬运方式",4,30,"“红十字会”应急救援"]
[32,"心肺复苏术","能够掌握事故现场的心肺复苏、人工呼吸等自救互救的基本技能，并会操作。","心肺复苏、人工呼吸操作技能",4,30]

{"sheet":"2023年燕化实习装置分布情况","index":4,"n_rows":19,"n_cols":6,"rows_kept":19,"merged":[[0,1,0,5],[2,0,4,0],[2,1,4,1],[2,5,4,5],[6,0,7,0],[6,1,7,1],[6,3,7,3],[6,5,7,5],[9,0,10,0],[9,1,10,1],[9,3,10,3],[9,5,10,5],[15,0,18,0]]}
[null,"燕化公司接待高等院校实习装置分布情况（2023）"]
["序号","单位","装置、操作单元","实习专业","接待容量","联系人"]
[1,"炼油厂","常减压蒸馏、延迟焦化、高压加氢裂化、制氢、三废处理","炼油、化学、化工、防腐、环境工程","一个班共35人","吴丽楠69334430 15117969453"]
[null,null,"重整加氢、中压加氢裂化","炼油、化学、化工、防腐、环境工程","一个班共35人"]
[null,null,"气体分馏、制氢、催化重整","炼油、化学、化工、防腐、环境工程","一个班共35人"]
[2,"烯烃厂","裂解、乙二醇、制苯、苯乙烯、聚苯乙烯","化工、化学、防腐","一个班共35人","梁靖华 69346465 3521770376"]
[3,"合成树脂厂","聚丙烯","化工、化学、高分子、防腐","一个班共35人","刘文凡 69366601 13693307811"]
[null,null,"聚烯烃（高压、低压聚乙烯）",null,"一个班共35人"]
[4,"化学品厂","苯酚丙酮（两套）","化工、化学、高分子、防腐","一个班共35人","张建宏13621005776"]
[5,"储运厂","装油单元、油品单元、原胶厂罐区车间","储运、包装机械（参观实习）","一个班共35人","刘瑛69342713 13693001232"]
[null,null,"固体料：一成品、二成品、三成品",null,"一个班共35人"]
[6,"合成橡胶厂","顺丁车间、烯烃车间","高分子、化工","一个班共35人","张玉环69343450 13691530957"]
[7,"检验计量中心","各分析站","化学、分析","同时两个班共70人（分炼油、化工区域）","魏杰69344135 13641266095"]
[8,"热电部","第一热力车间（一电站）\n第三热力车间（三电站）","动力工程、电气专业、环境工程","同时两个班共70人（分炼油、化工区域）","乌兰克69342601 13810201453"]
[9,"职业病防治所",null,null,"一个班共35人","时锐81337532 13718942757"]
["改制企业学校联系","中燕建设","设备、机电、仪表维护","机、电、仪等工程","同时两个班共70人（分炼油、化工区域）","李玉杰17718355223"]
[null,"威立雅水务公司","东区水处理、牛口峪水库","环境工程（参观实习）","一个班","张冬生13681131359"]
[null,"北京燕华工程建设有限公司","机加工车间","机械加工与制造","一个班","赵忠霞18010132198"]
[null,"北京燕化正邦设备检修有限公司","机架，设备维修","设备制造","一个班","邢桂玲13701318653"]

{"sheet":"22-23春教学进程","index":5,"n_rows":144,"n_cols":29,"rows_kept":144,"merged":[[0,0,0,28],[1,0,2,0],[1,1,2,1],[1,2,2,2],[1,3,2,3],[1,4,2,4],[1,5,2,5],[1,6,2,6],[1,7,2,7],[1,8,1,27],[1,28,2,28],[140,26,141,28]]}
["2022-2023学年春季学期教学进程表"]
["院系名称","年级","专业班级","班级","专业","年级","年级专业","人数","教学周",{"$nulls":19},"实践环节安排"]
[{"$nulls":8},0,1,2,3,4,5,6,7,8,9,10,11,12,13,14,15,16,17,18,19]
["安全工程学院","19级","安19-12","安191","安全工程","2019","2019安全工程",60,null,"×","×","×","×","×","×","×","×","×","×","×","×","×","×","×","×","×","×",null,"1-18周毕业设计(论文)"]
["新材料与化工学院","19级","功材19-1","功材191","功能材料","2019","2019功能材料",28,null,"×","×","×","×","×","×","×","×","×","×","×","×","×","×","×","×","×","×",null,"1-18周毕业设计(论文)"]
["新材料与化工学院","19级","高19-123","高191","高分子材料与工程","2019","2019高分子材料与工程",72,null,"×","×","×","×","×","×","×","×","×","×","×","×","×","×","×","×","×","×",null,"1-18周毕业设计(论文)"]
["新材料与化工学院","19级","材19-1","材191","材料科学与工程","2019","2019材料科学与工程",33,null,"×","×","×","×","×","×","×","×","×","×","×","×","×","×","×","×","×","×",null,"1-18周毕业设计(论文)"]
["新材料与化工学院","19级","应19-12","应191","应用化学","2019","2019应用化学",30,null,"×","×","×","×","×","×","×","×","×","×","×","×","×","×","×","×","×","×",null,"1-18周毕业设计(论文)"]
["新材料与化工学院","19级","药19-12","药191","制药工程","2019","2019制药工程",59,null,"×","×","×","×","×","×","×","×","×","×","×","×","×","×","×","×","×","×",null,"1-18周毕业设计(论文)"]
["新材料与化工学院","19级","生物19-1","生物191","生物制药","2019","2019生物制药",27,null,"×","×","×","×","×","×","×","×","×","×","×","×","×","×","×","×","×","×",null,"1-18周毕业设计(论文)"]
["新材料与化工学院","19级","化19-123","化191","化学工程与工艺","2019","2019化学工程与工艺",84,null,"×","×","×","×","×","×","×","×","×","×","×","×","×","×","×","×","×","×",null,"1-18周毕业设计(论文)"]
["机械工程学院","19级","能动19-12","能动191","能源与动力工程","2019","2019能源与动力工程",58,null,"×","×","×","×","×","×","×","×","×","×","×","×","×","×","×","×","×","×",null,"1-18周毕业设计(论文)"]
["机械工程学院","19级","机电19-12","机电191","机械电子工程","2019","2019机械电子工程",70,null,"×","×","×","×","×","×","×","×","×","×","×","×","×","×","×","×","×","×",null,"1-18周毕业设计(论文)"]
["机械工程学院","19级","机19-12","机191","机械工程","2019","2019机械工程",46,null,"×","×","×","×","×","×","×","×","×","×","×","×","×","×","×","×","×","×",null,"1-18周毕业设计(论文)"]
["机械工程学院","19级","机器人19-1","机器人191","机器人工程","2019","2019机器人工程",28,null,"×","×","×","×","×","×","×","×","×","×","×","×","×","×","×","×","×","×",null,"1-18周毕业设计(论文)"]
["机械工程学院","19级","环19-123","环191","环境工程","2019","2019环境工程",82,null,"×","×","×","×","×","×","×","×","×","×","×","×","×","×","×","×","×","×",null,"1-18周毕业设计(论文)"]
["机械工程学院","19级","储19-12","储191","油气储运工程","2019","2019油气储运工程",51,null,"×","×","×","×","×","×","×","×","×","×","×","×","×","×","×","×","×","×",null,"1-18周毕业设计(论文)"]
["经济管理学院","19级","营19-12","营191","市场营销","2019","2019市场营销",32,null,"×","×","×","×","×","×","×","×","×","×","×","×","×","×","×","×","×","×",null,"1-18周毕业设计(论文)"]
["经济管理学院","19级","物19-12","物191","物流管理","2019","2019物流管理",59,null,"×","×","×","×","×","×","×","×","×","×","×","×","×","×","×","×","×","×",null,"1-18周毕业设计(论文)"]
["经济管理学院","19级","电商19-1","电商191","电子商务","2019","2019电子商务",24,null,"×","×","×","×","×","×","×","×","×","×","×","×","×","×","×","×","×","×",null,"1-18周毕业设计(论文)"]
["经济管理学院","19级","会193","会193","会计学(国际会计师方向)","2019","2019会计学(国际会计师方向)",33,null,"×","×","×","×","×","×","×","×","×","×","×","×","×","×","×","×","×","×",null,"1-18周毕业设计(论文)"]
["经济管理学院","19级","会19-12","会191","会计学","2019","2019会计学",51,null,"×","×","×","×","×","×","×","×","×","×","×","×","×","×","×","×","×","×",null,"1-18周毕业设计(论文)"]
["经济管理学院","19级","数管19-12","数管191","大数据管理与应用","2019","2019大数据管理与应用",57,null,"×","×","×","×","×","×","×","×","×","×","×","×","×","×","×","×","×","×",null,"1-18周毕业设计(论文)"]
["经济管理学院","19级","国19-123","国191","国际经济与贸易","2019","2019国际经济与贸易",76,null,"×","×","×","×","×","×","×","×","×","×","×","×","×","×","×","×","×","×",null,"1-18周毕业设计(论文)"]
["人文社科学院","19级","人资19-12","人资191","人力资源管理","2019","2019人力资源管理",72,null,"☆","☆","☆","☆","☆","☆","☆","☆","☆","☆","☆","☆","☆","☆","☆","☆","☆","☆",null,"1-18周毕业设计(论文)\n专业实习（18周分散）"]
["人文社科学院","19级","旅19-12","旅191","旅游管理","2019","2019旅游管理",47,null,"☆","☆","☆","☆","☆","☆","☆","☆","☆","☆","☆","☆","☆","☆","☆","☆","☆","☆",null,"1-18周毕业设计(论文)\n旅游专业实习（18周分散）"]
["人文社科学院","19级","会展19-1","会展191","会展经济与管理","2019","2019会展经济与管理",41,null,"☆","☆","☆","☆","☆","☆","☆","☆","☆","☆","☆","☆","☆","☆","☆","☆","☆","☆",null,"1-18周毕业设计(论文)\n会展专业实习18周（分散）"]
["信息工程学院","19级","通19-12","通191","通信工程","2019","2019通信工程",56,null,"×","×","×","×","×","×","×","×","×","×","×","×","×","×","×","×","×","×",null,"1-18周毕业设计(论文)"]
["信息工程学院","19级","计19-12","计191","计算机科学与技术","2019","2019计算机科学与技术",71,null,"×","×","×","×","×","×","×","×","×","×","×","×","×","×","×","×","×","×",null,"1-18周毕业设计(论文)\n岗位实习6周（分散）"]
["信息工程学院","19级","物联网19-1","物联网191","物联网工程","2019","2019物联网工程",29,null,"×","×","×","×","×","×","×","×","×","×","×","×","×","×","×","×","×","×",null,"1-18周毕业设计(论文)"]
["信息工程学院","19级","电19-12","电191","电气工程及其自动化","2019","2019电气工程及其自动化",63,null,"×","×","×","×","×","×","×","×","×","×","×","×","×","×","×","×","×","×",null,"1-18周毕业设计(论文)"]
["信息工程学院","19级","大数据19-1","大数据191","数据科学与大数据技术","2019","2019数据科学与大数据技术",31,null,"×","×","×","×","×","×","×","×","×","×","×","×","×","×","×","×","×","×",null,"1-18周毕业设计(论文)\n岗位实习6周（分散）"]
["信息工程学院","19级","自19-123","自191","自动化","2019","2019自动化",86,null,"×","×","×","×","×","×","×","×","×","×","×","×","×","×","×","×","×","×",null,"1-18周毕业设计(论文)\n岗位实习4周（分散）"]
["机械工程学院","专升本21","机G21-12","机G211","机械工程","2021","2021机械工程专升本",29,null,"×","×","×","×","×","×","×","×","×","×","×","×","×","×","×","×","×","×",null,"1-18周毕业设计(论文)"]
["经济管理学院","专升本21","会G21-1","会G211","会计学","2021","2021会计学专升本",14,null,"×","×","×","×","×","×","×","×","×","×","×","×","×","×","×","×","×","×",null,"1-18周毕业设计(论文)"]
["经济管理学院","专升本21","国G21-1","国G211","国际经济与贸易","2021","2021国际经济与贸易专升本",8,null,"×","×","×","×","×","×","×","×","×","×","×","×","×","×","×","×","×","×",null,"1-18周毕业设计(论文)"]
["人文社科学院","专升本21","人资G21-1","人资G211","人力资源管理","2021","2021人力资源管理",68,null,"×","×","×","×","×","×","×","×","×","×","×","×","×","×","×","×","×","×",null,"1-18周毕业设计(论文)\n专业实习G10周（分散）"]
["人文社科学院","专升本21","旅G21-1","旅G211","旅游管理","2021","2021旅游管理专升本",16,null,"×","×","×","×","×","×","×","×","×","×","×","×","×","×","×","×","×","×",null,"1-18周毕业设计(论文)\n旅游专业实习18周（分散）"]
["信息工程学院","专升本21","计G21-12","计G211","计算机科学与技术","2021","2021计算机科学与技术专升本",22,null,"×","×","×","×","×","×","×","×","×","×","×","×","×","×","×","×","×","×",null,"1-18周毕业设计(论文)"]
["信息工程学院","专升本21","电G21-1","电G211","电气工程及其自动化","2021","2021电气工程及其自动化专升本",11,null,"×","×","×","×","×","×","×","×","×","×","×","×","×","×","×","×","×","×",null,"1-18周毕业设计(论文)"]
{"$rows_left_out":105}
{"sheet":"基础数据","index":6,"n_rows":33,"n_cols":14,"rows_kept":33,"hidden":true}
["安全工程学院","新材料与化工学院","机械工程学院","经济管理学院","人文社科学院","信息工程学院",{"$nulls":3},"2023春","校内",null,"教培实训课程","燕化实习装置"]
["安全工程","化学工程与工艺","过程装备与控制工程","大数据管理与应用","公共事业管理","测控技术与仪器专业",{"$nulls":3},"2023秋","校外",null,"炼油化工装置基本操作技能","炼油厂"]
["安全工程(双培)","材料科学与工程","环境工程","电子商务","会展","电气工程及其自动化",{"$nulls":6},"炼油系统仿真操作","烯烃厂"]
[null,"应用化学","机器人工程","国际经济与贸易","会展经济与管理","计算机科学与技术",{"$nulls":6},"化工系统仿真操作","合成树脂厂"]
[null,"高分子材料与工程","机械电子工程","会计学","旅游管理","数据科学与大数据技术",{"$nulls":6},"热工（CFB炉）仿真操作","化学品厂"]
[null,"制药工程","机械工程","会计学(国际会计师方向)","人力资源管理","数据科学与大数据技术(中法班)",{"$nulls":6},"高分子专业工程教育认证","储运厂"]
[null,"功能材料","机械类","市场营销",null,"通信工程",{"$nulls":6},"机泵拆装（过装专业）","合成橡胶厂"]
[null,"化学工程与工艺(双培)","能源与动力工程","物流管理",null,"物联网工程",{"$nulls":6},"常规仪表应用培训","检验计量中心"]
[null,"材料类","新能源科学与工程","信息管理与信息系统",null,"自动化",{"$nulls":6},"西门子PLC（S7-300）应用培训","热电部"]
[null,"生物制药","油气储运工程",{"$nulls":9},"横河DCS（CS3000）应用培训","职业病防治所"]
[{"$nulls":12},"ECS700应用培训","中燕建设"]
[{"$nulls":12},"6kV变电站运行及相关技术","威立雅水务公司"]
[{"$nulls":12},"高压异步电动机二次回路故障查找","北京燕华工程建设有限公司"]
[{"$nulls":12},"欧姆龙PLC技术","北京燕化正邦设备检修有限公司"]
[{"$nulls":12},"人体触电的相关知识、配电系统设备参观 "]
[{"$nulls":12},"电气法律法规、安全用电                                 "]
[{"$nulls":12},"电气安全工作规程"]
[{"$nulls":12},"危化品工艺单元事故处理及应急处置"]
[{"$nulls":12},"直接作业仿真操作培训"]
[{"$nulls":12},"加氢裂化装置（炼油）认识实习学习系统"]
[{"$nulls":12},"初起火灾救援及灭火器的选择与使用"]
[{"$nulls":12},"空气呼吸器选择与佩戴"]
[{"$nulls":12},"消防基础与事故案例"]
[{"$nulls":12},"进入受限空间操作"]
[{"$nulls":12},"事故模拟安全演习"]
[{"$nulls":12},"结绳操作技能"]
[{"$nulls":12},"隐患排查及事故现场应急处置"]
[{"$nulls":12},"安全展板学习及考核"]
[{"$nulls":12},"火灾逃生与事故应急"]
[{"$nulls":12},"石油化工作业流程介绍与事故案例"]
[{"$nulls":12},"安全设备设施与个体防护用品"]
[{"$nulls":12},"现场创伤救护技术"]
[{"$nulls":12},"心肺复苏术"]