{"text_format":"3","workbook":"xlsx","n_sheets":7,"sheets":["2025年实习计划--燕化","2025年实习计划--其他","数据2","基础数据1","燕化公司接待高等院校实习装置分布情况（2025）","燕山石化教育培训中心学生实训课程明细（2025）","2024-2025学年春季学期教学进程表"],"not_rendered":{"external_links":1,"defined_names":10},"read":"whole","date_system":"1900"}

{"sheet":"2025年实习计划--燕化","index":0,"n_rows":1509,"n_cols":23,"rows_kept":1509,"merged":[[0,0,0,22],[1,0,1,22]]}
["北京石油化工学院2025年度实习计划表---燕化实习              "]
["1、请各位老师在绿色区域直接选择下拉菜单中的选项，无需手动输入\n2、请各位老师在填写“实习起始/终止时间”两列时，按2025/12/06格式输入日期"]
["序号","学期","院系","专业","班级","实践环节课程名称",null,"课程号","总周数","周次","学生男","学生女","学生人数","教师男","教师女","实习起始时间","实习终止时间","实习场所","实训课程/实习单位","实习内容与要求","带队教师姓名、联系方式、邮箱","经费预算","说明或备用方案"]
["示例","2025春","机械工程学院","人工智能","化18-123","生产实习",{"$f":"C4&F4","v":"机械工程学院生产实习"},{"$f":"VLOOKUP(G4,数据2!C:D,2,FALSE)","v":"ENV320"},3,"17-19周",43,28,71,1,1,"2024-06-13","2024-07-01","教培实训课程","炼油系统仿真操作"]
["示例","2025秋","机械工程学院","机械类","安181","专业实习",{"$f":"C5&F5","v":"机械工程学院专业实习"},{"$f":"VLOOKUP(G5,数据2!C:D,2,FALSE)","v":"MEE320"},1,"18周",13,14,27,1,1,"2024-06-20","2024-06-24","教培实训课程","热工（CFB炉）仿真操作"]
[null,null,"新材料与化工学院","化学工程与工艺(双培)",{"$nulls":3},{"$f":"VLOOKUP(G6,数据2!C:D,2,FALSE)","v":{"$error":"#N/A"}}]
[{"$nulls":7},{"$f":"VLOOKUP(G7,数据2!C:D,2,FALSE)","v":{"$error":"#N/A"}}]
[{"$nulls":6},"",{"$f":"VLOOKUP(G8,数据2!C:D,2,FALSE)","v":{"$error":"#N/A"}}]
[{"$nulls":6},"",{"$f":"VLOOKUP(G9,数据2!C:D,2,FALSE)","v":{"$error":"#N/A"}}]
[{"$nulls":6},"",{"$f":"VLOOKUP(G10,数据2!C:D,2,FALSE)","v":{"$error":"#N/A"}}]
[{"$nulls":6},"",{"$f":"VLOOKUP(G11,数据2!C:D,2,FALSE)","v":{"$error":"#N/A"}}]
[{"$nulls":6},"",{"$f":"VLOOKUP(G12,数据2!C:D,2,FALSE)","v":{"$error":"#N/A"}}]
[{"$nulls":6},"",{"$f":"VLOOKUP(G13,数据2!C:D,2,FALSE)","v":{"$error":"#N/A"}}]
[{"$nulls":6},"",{"$f":"VLOOKUP(G14,数据2!C:D,2,FALSE)","v":{"$error":"#N/A"}}]
[{"$nulls":6},"",{"$f":"VLOOKUP(G15,数据2!C:D,2,FALSE)","v":{"$error":"#N/A"}}]
[{"$nulls":6},"",{"$f":"VLOOKUP(G16,数据2!C:D,2,FALSE)","v":{"$error":"#N/A"}}]
[{"$nulls":6},"",{"$f":"VLOOKUP(G17,数据2!C:D,2,FALSE)","v":{"$error":"#N/A"}}]
[{"$nulls":6},"",{"$f":"VLOOKUP(G18,数据2!C:D,2,FALSE)","v":{"$error":"#N/A"}}]
[{"$nulls":6},"",{"$f":"VLOOKUP(G19,数据2!C:D,2,FALSE)","v":{"$error":"#N/A"}}]
[{"$nulls":6},"",{"$f":"VLOOKUP(G20,数据2!C:D,2,FALSE)","v":{"$error":"#N/A"}}]
[{"$nulls":6},"",{"$f":"VLOOKUP(G21,数据2!C:D,2,FALSE)","v":{"$error":"#N/A"}}]
[{"$nulls":6},"",{"$f":"VLOOKUP(G22,数据2!C:D,2,FALSE)","v":{"$error":"#N/A"}}]
[{"$nulls":6},"",{"$f":"VLOOKUP(G23,数据2!C:D,2,FALSE)","v":{"$error":"#N/A"}}]
[{"$nulls":6},"",{"$f":"VLOOKUP(G24,数据2!C:D,2,FALSE)","v":{"$error":"#N/A"}}]
[{"$nulls":6},"",{"$f":"VLOOKUP(G25,数据2!C:D,2,FALSE)","v":{"$error":"#N/A"}}]
[{"$nulls":6},"",{"$f":"VLOOKUP(G26,数据2!C:D,2,FALSE)","v":{"$error":"#N/A"}}]
[{"$nulls":6},"",{"$f":"VLOOKUP(G27,数据2!C:D,2,FALSE)","v":{"$error":"#N/A"}}]
[{"$nulls":6},"",{"$f":"VLOOKUP(G28,数据2!C:D,2,FALSE)","v":{"$error":"#N/A"}}]
[{"$nulls":6},"",{"$f":"VLOOKUP(G29,数据2!C:D,2,FALSE)","v":{"$error":"#N/A"}}]
[{"$nulls":6},"",{"$f":"VLOOKUP(G30,数据2!C:D,2,FALSE)","v":{"$error":"#N/A"}}]
[{"$nulls":6},"",{"$f":"VLOOKUP(G31,数据2!C:D,2,FALSE)","v":{"$error":"#N/A"}}]
[{"$nulls":6},"",{"$f":"VLOOKUP(G32,数据2!C:D,2,FALSE)","v":{"$error":"#N/A"}}]
[{"$nulls":6},"",{"$f":"VLOOKUP(G33,数据2!C:D,2,FALSE)","v":{"$error":"#N/A"}}]
[{"$nulls":6},"",{"$f":"VLOOKUP(G34,数据2!C:D,2,FALSE)","v":{"$error":"#N/A"}}]
[{"$nulls":6},"",{"$f":"VLOOKUP(G35,数据2!C:D,2,FALSE)","v":{"$error":"#N/A"}}]
[{"$nulls":6},"",{"$f":"VLOOKUP(G36,数据2!C:D,2,FALSE)","v":{"$error":"#N/A"}}]
[{"$nulls":6},"",{"$f":"VLOOKUP(G37,数据2!C:D,2,FALSE)","v":{"$error":"#N/A"}}]
[{"$nulls":6},"",{"$f":"VLOOKUP(G38,数据2!C:D,2,FALSE)","v":{"$error":"#N/A"}}]
[{"$nulls":6},"",{"$f":"VLOOKUP(G39,数据2!C:D,2,FALSE)","v":{"$error":"#N/A"}}]
[{"$nulls":6},"",{"$f":"VLOOKUP(G40,数据2!C:D,2,FALSE)","v":{"$error":"#N/A"}}]
{"$rows_left_out":1470}
{"sheet":"2025年实习计划--其他","index":1,"n_rows":1303,"n_cols":24,"rows_kept":1303,"merged":[[0,0,0,23],[1,0,1,23]]}
["北京石油化工学院2025年度实习计划表---其他实习(非燕化实习均填此表）"]
["1、请各位老师在绿色区域直接选择下拉菜单中的选项，无需手动输入\n2、请各位老师在填写“实习起始/终止时间”两列时，按2025/12/06格式输入日期"]
["序号","学期","院系","专业","班级","实践环节课程名称",null,"课程号","总周数","周次","学生男","学生女","学生人数","教师人数","教师男","教师女","实习起始时间","实习终止时间","实习类型","实习单位名称/场所","实习目的、内容与要求","带队教师姓名、联系方式、邮箱","经费预算","说明或备用方案"]
["示例","2025春","机械工程学院","人工智能","化18-123","认识实习",{"$f":"C4&F4","v":"机械工程学院认识实习"},{"$f":"VLOOKUP(G4,数据2!C:D,2,FALSE)","v":"EPE204"},3,"17-19周",43,28,71,null,1,1,"2024-06-13","2024-07-01","校内"]
[null,null,"安全工程学院","安全工程",{"$nulls":3},{"$f":"VLOOKUP(G5,数据2!C:D,2,FALSE)","v":{"$error":"#N/A"}},{"$nulls":10},"校外"]
[null,null,"新材料与化工学院","应用化学",null,null,{"$f":"C6&F6","v":"新材料与化工学院"},{"$f":"VLOOKUP(G6,数据2!C:D,2,FALSE)","v":{"$error":"#N/A"}}]
[null,null,"经济管理学院",{"$nulls":3},"经济管理学院",{"$f":"VLOOKUP(G7,数据2!C:D,2,FALSE)","v":{"$error":"#N/A"}}]
[{"$nulls":6},"",{"$f":"VLOOKUP(G8,数据2!C:D,2,FALSE)","v":{"$error":"#N/A"}}]
[{"$nulls":6},"",{"$f":"VLOOKUP(G9,数据2!C:D,2,FALSE)","v":{"$error":"#N/A"}}]
[{"$nulls":6},"",{"$f":"VLOOKUP(G10,数据2!C:D,2,FALSE)","v":{"$error":"#N/A"}}]
[{"$nulls":6},"",{"$f":"VLOOKUP(G11,数据2!C:D,2,FALSE)","v":{"$error":"#N/A"}}]
[{"$nulls":6},"",{"$f":"VLOOKUP(G12,数据2!C:D,2,FALSE)","v":{"$error":"#N/A"}}]
[{"$nulls":6},"",{"$f":"VLOOKUP(G13,数据2!C:D,2,FALSE)","v":{"$error":"#N/A"}}]
[{"$nulls":6},"",{"$f":"VLOOKUP(G14,数据2!C:D,2,FALSE)","v":{"$error":"#N/A"}}]
[{"$nulls":6},"",{"$f":"VLOOKUP(G15,数据2!C:D,2,FALSE)","v":{"$error":"#N/A"}}]
[{"$nulls":6},"",{"$f":"VLOOKUP(G16,数据2!C:D,2,FALSE)","v":{"$error":"#N/A"}}]
[{"$nulls":6},"",{"$f":"VLOOKUP(G17,数据2!C:D,2,FALSE)","v":{"$error":"#N/A"}}]
[{"$nulls":6},"",{"$f":"VLOOKUP(G18,数据2!C:D,2,FALSE)","v":{"$error":"#N/A"}}]
[{"$nulls":6},"",{"$f":"VLOOKUP(G19,数据2!C:D,2,FALSE)","v":{"$error":"#N/A"}}]
[{"$nulls":6},"",{"$f":"VLOOKUP(G20,数据2!C:D,2,FALSE)","v":{"$error":"#N/A"}}]
[{"$nulls":6},"",{"$f":"VLOOKUP(G21,数据2!C:D,2,FALSE)","v":{"$error":"#N/A"}}]
[{"$nulls":6},"",{"$f":"VLOOKUP(G22,数据2!C:D,2,FALSE)","v":{"$error":"#N/A"}}]
[{"$nulls":6},"",{"$f":"VLOOKUP(G23,数据2!C:D,2,FALSE)","v":{"$error":"#N/A"}}]
[{"$nulls":6},"",{"$f":"VLOOKUP(G24,数据2!C:D,2,FALSE)","v":{"$error":"#N/A"}}]
[{"$nulls":6},"",{"$f":"VLOOKUP(G25,数据2!C:D,2,FALSE)","v":{"$error":"#N/A"}}]
[{"$nulls":6},"",{"$f":"VLOOKUP(G26,数据2!C:D,2,FALSE)","v":{"$error":"#N/A"}}]
[{"$nulls":6},"",{"$f":"VLOOKUP(G27,数据2!C:D,2,FALSE)","v":{"$error":"#N/A"}}]
[{"$nulls":6},"",{"$f":"VLOOKUP(G28,数据2!C:D,2,FALSE)","v":{"$error":"#N/A"}}]
[{"$nulls":6},"",{"$f":"VLOOKUP(G29,数据2!C:D,2,FALSE)","v":{"$error":"#N/A"}}]
[{"$nulls":6},"",{"$f":"VLOOKUP(G30,数据2!C:D,2,FALSE)","v":{"$error":"#N/A"}}]
[{"$nulls":6},"",{"$f":"VLOOKUP(G31,数据2!C:D,2,FALSE)","v":{"$error":"#N/A"}}]
[{"$nulls":6},"",{"$f":"VLOOKUP(G32,数据2!C:D,2,FALSE)","v":{"$error":"#N/A"}}]
[{"$nulls":6},"",{"$f":"VLOOKUP(G33,数据2!C:D,2,FALSE)","v":{"$error":"#N/A"}}]
[{"$nulls":6},"",{"$f":"VLOOKUP(G34,数据2!C:D,2,FALSE)","v":{"$error":"#N/A"}}]
[{"$nulls":6},"",{"$f":"VLOOKUP(G35,数据2!C:D,2,FALSE)","v":{"$error":"#N/A"}}]
[{"$nulls":6},"",{"$f":"VLOOKUP(G36,数据2!C:D,2,FALSE)","v":{"$error":"#N/A"}}]
[{"$nulls":6},"",{"$f":"VLOOKUP(G37,数据2!C:D,2,FALSE)","v":{"$error":"#N/A"}}]
[{"$nulls":6},"",{"$f":"VLOOKUP(G38,数据2!C:D,2,FALSE)","v":{"$error":"#N/A"}}]
[{"$nulls":6},"",{"$f":"VLOOKUP(G39,数据2!C:D,2,FALSE)","v":{"$error":"#N/A"}}]
[{"$nulls":6},"",{"$f":"VLOOKUP(G40,数据2!C:D,2,FALSE)","v":{"$error":"#N/A"}}]
{"$rows_left_out":1264}
{"sheet":"数据2","index":2,"n_rows":378,"n_cols":11,"rows_kept":378,"hidden":true,"merged":[[0,0,1,0],[0,1,1,1],[0,3,1,3],[0,4,1,4],[0,5,1,5],[0,6,1,6]]}
["开课学年学期","开课院系",null,"课程号","课程名称","课程性质","专业"]
[{"$nulls":10},"https://baijiahao.baidu.com/s?id=1798938104068382402&wfr=spider&for=pc"]
["25春","信息工程学院","信息工程学院计算机专业实习","CST318","计算机专业实习","实践环节","计算机科学与技术"]
["25春","信息工程学院","信息工程学院计算机专业实习","CST318","计算机专业实习","实践环节","智能计算类"]
["25春","信息工程学院","信息工程学院计算机专业实习","CST318","计算机专业实习","实践环节","计算机科学与技术（致远新工科实验班）"]
["25春","信息工程学院","信息工程学院岗位实习","CST406","岗位实习","实践环节","计算机科学与技术"]
["25春","人文社科学院","人文社科学院会展专业实习","EEM401","会展专业实习","实践环节","会展"]
["25春","人文社科学院","人文社科学院旅游认识实习","TRM210","旅游认识实习","实践环节","旅游管理"]
["25春","人文社科学院","人文社科学院旅游专业实习","TRM401","旅游专业实习","实践环节","旅游管理"]
["25春","信息工程学院","信息工程学院电子课程设计","EEE211","电子课程设计","实践环节","机器人工程"]
["25春","信息工程学院","信息工程学院电子课程设计","EEE211","电子课程设计","实践环节","机械工程"]
["25春","信息工程学院","信息工程学院电子课程设计","EEE211","电子课程设计","实践环节","智能制造类"]
["25春","信息工程学院","信息工程学院大数据专业实习","BDT311","大数据专业实习","实践环节","数据科学与大数据技术(中法班)"]
["25春","信息工程学院","信息工程学院大数据专业实习","BDT311","大数据专业实习","实践环节","数据科学与大数据技术"]
["25春","信息工程学院","信息工程学院岗位实习","BDT402","岗位实习","实践环节","数据科学与大数据技术"]
["25春","信息工程学院","信息工程学院岗位实习","BDT402","岗位实习","实践环节","数据科学与大数据技术(中法班)"]
["25春","工程师学院","工程师学院工程训练A（I）","EEC101","工程训练A（I）","实践环节","机械工程"]
["25春","工程师学院","工程师学院工程训练A（I）","EEC101","工程训练A（I）","实践环节","智能制造工程"]
["25春","工程师学院","工程师学院工程训练C","EEC103","工程训练C","实践环节","生物制药"]
["25春","工程师学院","工程师学院工程训练C","EEC103","工程训练C","实践环节","制药工程"]
["25春","工程师学院","工程师学院工程训练C","EEC103","工程训练C","实践环节","机器人工程"]
["25春","信息工程学院","信息工程学院计算机编程能力实训","FCE204","计算机编程能力实训","实践环节","物联网工程"]
["25春","信息工程学院","信息工程学院计算机编程能力实训","FCE204","计算机编程能力实训","实践环节","电气工程及其自动化"]
["25春","信息工程学院","信息工程学院计算机编程能力实训","FCE204","计算机编程能力实训","实践环节","自动化"]
["25春","信息工程学院","信息工程学院计算机编程能力实训","FCE204","计算机编程能力实训","实践环节","电气工程及其自动化"]
["25春","新材料与化工学院","新材料与化工学院科学研究方法训练","MSE323","科学研究方法训练","实践环节","材料科学与工程"]
["25春","信息工程学院","信息工程学院电子工程设计A","EEE209","电子工程设计A","实践环节","电气工程及其自动化"]
["25春","信息工程学院","信息工程学院电子工程设计A","EEE209","电子工程设计A","实践环节","自动化"]
["25春","机械工程学院","机械工程学院机械工程基础课程设计","MEE211","机械工程基础课程设计","实践环节","高分子材料与工程"]
["25春","机械工程学院","机械工程学院机械工程基础课程设计","MEE211","机械工程基础课程设计","实践环节","材料科学与工程"]
["25春","信息工程学院","信息工程学院C语言课程设计","FCE201","C语言课程设计","实践环节","计算机科学与技术"]
["25春","经济管理学院","经济管理学院程序设计综合训练","BDMA206","程序设计综合训练","实践环节","大数据管理与应用"]
["25春","经济管理学院","经济管理学院程序设计综合训练","BDMA206","程序设计综合训练","实践环节","大数据管理与应用"]
["25春","经济管理学院","经济管理学院专业认识实习","BDMA107","专业认识实习","实践环节","大数据管理与应用"]
["25春","经济管理学院","经济管理学院大数据存储实践","BDMA306","大数据存储实践","实践环节","大数据管理与应用"]
["25春","经济管理学院","经济管理学院大数据综合实践","BDMA308","大数据综合实践","实践环节","大数据管理与应用"]
["25春","经济管理学院","经济管理学院大数据综合实践","BDMA308","大数据综合实践","实践环节","大数据管理与应用"]
["25春","信息工程学院","信息工程学院物联网工程综合设计","IOT311","物联网工程综合设计","实践环节","物联网工程"]
["25春","新材料与化工学院","新材料与化工学院制药工程专业实验","PME311","制药工程专业实验","实践环节","制药工程"]
["25春","安全工程学院","安全工程学院安全原理与安全管理学课程设计","SAE205","安全原理与安全管理学课程设计","实践环节","安全工程"]
{"$rows_left_out":339}
{"sheet":"基础数据1","index":3,"n_rows":26,"n_cols":14,"rows_kept":26,"hidden":true}
["安全工程学院","新材料与化工学院","机械工程学院","经济管理学院","人文社科学院","信息工程学院","人工智能学院",null,null,"2025春","校内",null,"教培实训课程","燕化实习装置"]
["安全工程","化学工程与工艺","环境工程","大数据管理与应用","会展","电气工程及其自动化","人工智能",null,null,"2025秋","校外",null,"炼油化工装置基本操作技能","炼油厂"]
[null,"材料科学与工程","机器人工程","电子商务","会展经济与管理","计算机科学与技术",{"$nulls":6},"石油化工单元仿真操作","烯烃厂"]
[null,"高分子材料与工程","机械电子工程","国际经济与贸易","旅游管理","数据科学与大数据技术",{"$nulls":6},"炼油系统仿真操作","合成树脂厂"]
[null,"制药工程","机械工程","会计学","人力资源管理","数据科学与大数据技术(中法班)",{"$nulls":6},"化工系统仿真操作","化学品厂"]
[null,"化学工程与工艺(双培)","能源与动力工程","会计学(国际会计师方向)",null,"通信工程",{"$nulls":6},"热工（CFB炉）仿真操作","合成橡胶厂"]
[null,"生物制药","新能源科学与工程","市场营销",null,"物联网工程",{"$nulls":6},"高分子专业工程教育认证（聚丙烯）","检验计量中心"]
[null,"药物分析","油气储运工程","物流管理",null,"自动化",{"$nulls":6},"高分子专业工程教育认证（SBS）","热电部"]
[null,"应用化学","智能制造工程","审计学",{"$nulls":8},"常规仪表应用培训","职业病防治所"]
[{"$nulls":12},"西门子PLC（S7-300）应用培训","威立雅水务公司"]
[{"$nulls":12},"横河DCS（CS3000）应用培训","北京燕华工程建设有限公司"]
[{"$nulls":12},"ECS700应用培训","北京燕化东方工贸有限公司"]
[{"$nulls":12},"6kV变电站运行及相关技术","北京中燕建设工程有限公司"]
[{"$nulls":12},"高压异步电动机二次回路故障查找"]
[{"$nulls":12},"欧姆龙PLC技术"]
[{"$nulls":12},"人体触电的相关知识、配电系统设备参观"]
[{"$nulls":12},"电气法律法规、安全用电"]
[{"$nulls":12},"电气安全工作规程"]
[{"$nulls":12},"特种作业低压电工\n取证班"]
[{"$nulls":12},"危化品工艺单元事故处理及应急处置"]
[{"$nulls":12},"直接作业仿真操作培训"]
[{"$nulls":12},"加氢裂化装置（炼油）认识实习"]
[{"$nulls":12},"初起火灾救援及灭火器的选择与使用"]
[{"$nulls":12},"空气呼吸器选择与佩戴"]
[{"$nulls":12},"现场创伤救护技术"]
[{"$nulls":12},"心肺复苏术"]

{"sheet":"燕化公司接待高等院校实习装置分布情况（2025）","index":4,"n_rows":17,"n_cols":6,"rows_kept":17,"merged":[[0,1,0,5],[2,0,4,0],[2,1,4,1],[2,5,4,5],[6,0,7,0],[6,1,7,1],[6,3,7,3],[6,5,7,5],[13,0,16,0]]}
[null,"燕化公司接待高等院校实习装置分布情况（2025）"]
["序号","单位","装置、操作单元","实习专业","接待容量","联系人"]
[1,"炼油厂","常减压蒸馏、延迟焦化、高压加氢裂化、制氢、三废处理","炼油、化学、化工、防腐、环境工程","一个班共35人","吴丽楠69334430 15117969453"]
[null,null,"重整加氢、中压加氢裂化","炼油、化学、化工、防腐、环境工程","一个班共35人"]
[null,null,"气体分馏、制氢、催化重整","炼油、化学、化工、防腐、环境工程","一个班共35人"]
[2,"烯烃厂","裂解、乙二醇、制苯、苯乙烯、聚苯乙烯","化工、化学、防腐","一个班共35人","梁靖华 69346465 3521770376"]
[3,"合成树脂厂","聚丙烯","化工、化学、高分子、防腐","一个班共35人","刘文凡 69366601 13693307811"]
[null,null,"聚烯烃（高压、低压聚乙烯）",null,"一个班共35人"]
[4,"化学品厂","苯酚丙酮（两套）","化工、化学、高分子、防腐","一个班共35人","张建宏13621005776"]
[5,"合成橡胶厂","顺丁车间、烯烃车间","高分子、化工","一个班共35人","张玉环69343450 13691530957"]
[6,"检验计量中心","各分析站","化学、分析","同时两个班共70人（分炼油、化工区域）","魏杰69344135 13641266095"]
[7,"热电部","第一热力车间（一电站）\n第三热力车间（三电站）","动力工程、电气专业、环境工程","同时两个班共70人（分炼油、化工区域）","乌兰克69342601 13810201453"]
[8,"职业病防治所",null,null,"一个班共35人"]
["改\n制\n单\n位\n学\n校\n联\n系","威立雅水务公司","东区水处理、牛口峪水库","环境工程（参观实习）","一个班"]
[null,"北京燕华工程建设有限公司","机加工车间","机械加工与制造","一个班","赵忠霞18010132198"]
[null,"北京燕化东方工贸有限公司","机械、环保、机电","机电、机械、环境、安全工程等","一个班","黎海芳13436560188"]
[null,"北京中燕建设工程有限公司","安全实训基地分为“安全专业”和“专业安全”两大培训区域。可开展用火作业、高处作业、临时用电等16种施工作业环境模拟培训；设立有设备、电气、仪表等专业的实操培训室和安全创新工作室。通过实景还原类设备和实操实训类设备，模拟机、电、仪等专业的检维修作业场景，对施工作业人员进行技能操作培训和实操能力验证。","机、电、仪、安全工程等","同时两个班共70人"]

{"sheet":"燕山石化教育培训中心学生实训课程明细（2025）","index":5,"n_rows":27,"n_cols":11,"rows_kept":27,"merged":[[0,0,0,10],[2,9,8,9],[2,10,8,10],[9,9,19,9],[9,10,19,10],[20,9,26,9],[20,10,26,10]]}
["燕山石化教育培训中心学生实训课程明细（2025）"]
["序号","部门名称","实训室名称","实训课程名称","实训目的","主要内容","课时","人数","实习场所","联系人","联系方式"]
[1,"炼化仿真","石油化工训练装置","炼油化工装置基本操作技能","1.通过训练装置实习,熟悉对二甲苯装置的生产工艺流程，掌握化工基本操作技能和化工单元操作，学会装置开停工操作，增强工程实践能力；\n⒉培养学生良好职业素养和职业道德，成为具有一定工程实践能力、良好的沟通能力和团队合作精神的化工技术人才。","1.安全帽、安全带的使用方法\n2. 训练装置工艺流程图的识读；\n3. 离心泵的工作原理、操作及日常维护；\n4. DCS的基本功能；\n5.加热炉、精馏塔等典型设备的控制方案；\n6.训练装置的开停车；\n7. 正常巡检及工艺台帐记录；\n8. 常见故障的处理方法",40,30,"教育培训中心西校区石油化工训练装置","杨扬","69334955\n1326405682\nyangy01.yssh@sinopec.com"]
[2,"炼化仿真","仿真培训室","石油化工单元仿真操作","1.以仿真模型为载体，学会离心泵的启动、停止和切换；\n2.以仿真模型为载体，学会精馏塔的开停工操作；\n3.以仿真模型为载体，学会精馏塔的工艺参数调整；\n4.学习现场操作事故案例，树立安全规范操作意识，培养规范操作习惯。","1.离心泵的启动、停止和切换；\n2.DCS功能应用；\n3.精馏塔的开停工操作；\n4.精馏塔的工艺参数调整；\n5.现场操作事故案例学习",40,30,"教育培训中心西校区仿真培训室"]
[3,"炼化仿真","仿真培训室","炼油系统仿真操作","以炼油系统常减压装置为例：\n1.熟悉常减压装置的各项工艺参数；\n2.学会常减压工艺的开车步骤、DCS操作方法、生产操作的调节手段；\n3.熟悉设备的正常使用、仪表控制等的操作方法；\n4.熟悉常减压整个生产流程。","1. 原油的评价及由来\n2.换热器的原理、结构和日常操作\n3. 电脱盐的原理、结构和日常注意问题\n4. 塔的操作和基本生产原理\n5. 加热炉的原理、结构及操作\n6.产品质量的调节\n7. 炼油厂安全事例分析\n8.环保、腐蚀对装置的影响\n9.常减压开停车方案及事故处理原则\n10.仪表的基本知识\n11. DCS基础知识和操作\n12.各类常用设备的原理和结构及操作方法。",40,30,"教育培训中心西校区仿真培训室"]
[4,"炼化仿真","仿真培训室","化工系统仿真操作","以化工系统聚乙烯装置为例：\n1.熟悉聚乙烯装置的各项工艺参数；\n2.了解聚乙烯装置的工艺特点、开车步骤、DCS操作方法、生产操作的调节手段；\n3.熟悉设备的正常使用、仪表控制等的操作方法；\n4.了解聚乙烯生产操作的生产过程。","1.介绍生产工艺流程、工艺控制；\n2.仿真操作画面讲解及开车操作演练；\n3.聚乙烯仿真开车训练。",40,30,"教育培训中心西校区仿真培训室"]
[5,"炼化仿真","仿真培训室","热工（CFB炉）仿真操作","1.通过对CFB锅炉的工艺过程、操作原理、设备知识等方面的培训， 使参训人员了解CFB锅炉的生产过程、工艺原理，掌握设备及仪表控制等基本理论知识；\n2.通过进行CFB锅炉仿真操作培训，使参训人员熟悉CFB锅炉的各项工艺参数，熟练掌握CFB锅炉的开停车步骤、DCS操作方法、生产操作的调节手段，以及熟悉设备的正常使用、仪表控制等的操作方法，以提高参训人员的生产操作能力；\n3.掌握CFB锅炉操作的基本操作方法和基本控制方案。","1.介绍生产工艺流程、工艺控制；\n2.仿真操作画面讲解及开车操作演练；\n3.CFB锅炉仿真开车训练。",40,30,"教育培训中心西校区仿真培训室"]
[6,"炼化仿真","仿真培训室","高分子专业工程教育认证（聚丙烯）","1.熟悉聚丙烯装置的各项工艺参数；\n了解聚丙烯工艺的开车步骤、DCS操作方法、生产操作的调节手段；\n2.熟悉设备的正常使用、仪表控制等的操作方法；\n3.了解聚丙烯生产操作的生产过程；\n4.依据中国工程教育专业认证标准, 通过仿真实习达到能解决复杂工艺问题的毕业要求，提高学生的知识与技能素养。","1.介绍生产工艺流程、工艺控制；\n2.仿真操作画面讲解及开车操作演练；\n3. 聚丙烯仿真开车训练；\n4.分组研讨－复杂工艺问题解决方案。会运用深入的工程原理分析解决部分复杂工艺问题。",120,30,"教育培训中心西校区仿真培训室"]
[7,"炼化仿真","仿真培训室","高分子专业工程教育认证（SBS）","1.熟悉SBS装置的各项工艺参数；了解SBS工艺的开车步骤、DCS操作方法、生产操作的调节手段；\n2.熟悉设备的正常使用、仪表控制等的操作方法；\n3.了解SBS生产操作的生产过程；\n4.依据中国工程教育专业认证标准, 通过仿真实习达到能解决复杂工艺问题的毕业要求，提高学生的知识与技能素养。","1.介绍生产工艺流程、工艺控制；\n2.仿真操作画面讲解及开车操作演练；\n3. SBS仿真开车训练；\n4.分组研讨－复杂工艺问题解决方案。会运用深入的工程原理分析解决部分复杂工艺问题。",120,30,"教育培训中心西校区仿真培训室"]
[8,"电仪","常规表实训室","常规仪表应用培训","1.认识各类仪表；\n2.认识控制系统的构成；\n3.培养学生对仪表自控的工程应用能力。","1.回路调试；\n2.仪表校验；\n3.简单故障分析处理",40,20,"教育培训中心西校区常规表实训室","祝子强","69338654\n13691137372\nzhuzq.yssh@sinopec.com"]
[9,"电仪","PLC（S7-300）实训室","西门子PLC（S7-300）应用培训","1.认识S7-300软硬件；\n2.学会组态；\n3.了解西门子PLC的工程应用","1.S7-300软硬件；\n2.组态；\n3.以任务为中心学习西门子PLC的工程应用",40,20,"教育培训中心西校区PLC（S7-300）实训室"]
[10,"电仪","横河DCS（CS3000）实训室","横河DCS（CS3000）应用培训","1.认识CS3000系统软硬件；\n2.学会组态；\n3.了解CS3000的工程应用内容","1.CS3000软硬件；\n2.组态基础；\n3.系统应用与维护",40,20,"教育培训中心西校区横河DCS（CS3000）实训室"]
[11,"电仪","浙江中控DCS（ECS700）","ECS700应用培训","1.认识ECS700系统软硬件；\n2.学会组态；\n3.了解ECS700的工程应用内容","1.ECS700软硬件；\n2.组态基础；\n3.系统应用与维护。",40,20,"教育培训中心西校区浙江中控DCS（ECS700）实训室"]
[12,"电仪","6kV综合自动化变电站实训室","6kV变电站运行及相关技术","1.了解6kV变电站的系统组成；\n2.了解变电站运行的相关规程；\n3.了解基本的倒闸操作方法。","1.电力系统简介；\n2.倒闸操作规范；\n3.倒闸操作实操。",20,20,"教育培训中心西校区6kV综合自动化变电站实训室"]
[13,"电仪","二次回路实训室","高压异步电动机二次回路故障查找","1.掌握基本的识图方法；\n2.了解二次回路的工作原理；\n3.掌握基本的故障排查方法。","1.二次回路原理及组成；\n2.故障排查实操。",20,20,"教育培训中心西校区二次回路实训室"]
[14,"电仪","欧姆龙PLC实训室","欧姆龙PLC技术","1.了解PLC的原理；\n2.会使用编程软件编写简单的控制程序；\n3.外部接线和程序调试。","1.PLC简介；\n2.编程软件；\n3.编程方法及调试。",20,20,"教育培训中心西校区欧姆龙PLC实训室"]
[15,"电仪","电气实训室","人体触电的相关知识、配电系统设备参观","1.了解人体触电的相关知识；\n2.了解常用电气设备。","1.人体触电的相关知识；\n2.常用电气设备介绍。",4,20,"教育培训中心西校区电气实训室"]
[16,"电仪","电气实训室","电气法律法规、安全用电","1.了解安全生产法、北京市安全生产条例；                                                        2.了解电工特种作业管理标准；\n3.掌握安全用电的常识。","1.安全生产法、北京市安全生产条例；                                                         2.电工特种作业管理标准；                                  3.安全用电的常识。",4,20,"教育培训中心西校区电气实训室"]
[17,"电仪","电气实训室","电气安全工作规程","1.了解电气安全工作的组织措施和技术措施\n2.了解防雷和防静电技术\n3.了解电气防火技术","1.电气安全工作的组织措施和技术措施；                                                           2.防雷和防静电技术；\n3.电气防火技术。",4,20,"教育培训中心西校区电气实训室"]
[18,"电仪","电气实训室","特种作业低压电工\n取证班","1.掌握北京市“低压电工作业人员安全技术培训大纲和考核标准”所要求的培训内容,为通过北京市低压电工作业人员的考试奠定基础。\n2.根据培训对象的实际需求，增加工程实践的课时，提升学生电气工程认知能力，全面、系统认识、理解配电系统的结构、主要设备、运行方式；提高实践能力，掌握电气专业基本的操作技能。","1.安全基础知识\n2.安全技术基础知识\n3.安全技术专业知识\n4.实际操作技能","148(96培训+52自习）",30,"教育培训中心西校区电气实训室"]
[19,"安全环保","危化品实训基地","危化品工艺单元事故处理及应急处置","了解不同工艺单元在发生异常状况或事故时的处理过程及处置要求","工艺过程介绍、发现问题并及时处理",16,"≤45","教育培训中心危化品实训基地","李悦","69342755\n15010631213\nliy01.yssh@sinopec.com"]
[20,"安全环保","危化品实训基地","直接作业仿真操作培训","了解并掌握直接作业过程的特点、隐患排查及安全监护的相关要求","作业任务介绍、危害识别与隐患排除、安全措施检查与落实、开始作业。",16,"≤45","教育培训中心危化品实训基地"]
[21,"安全环保","危化品实训基地","加氢裂化装置（炼油）认识实习","该学习系统的三维模型是按燕山石化加氢裂化装置真实场景开发的。学生通过学习装置的知识点、回答思考题、完成任务，可掌握生产的HSE、工艺生产、设备、应急处理等方面知识。系统可自动评分。","加氢裂化装置仿真操作训练",16,"≤45","教育培训中心危化品实训基地"]
[22,"安全环保","危化品实训基地","初起火灾救援及灭火器的选择与使用","1.会判断不同类型的初起火灾；\n2.会选择使用灭火器材。","1.初起火灾扑救（理论）；\n2.灭火器的使用。",4,"≤25","教育培训中心危化品实训基地"]
[23,"安全环保","危化品实训基地","空气呼吸器选择与佩戴","会针对不同危险环境选择和正确佩戴空气呼吸器，能发现空气呼吸器存在的安全隐患，会进行判断其安全性。","空气呼吸器的选择、检查与佩戴",4,"≤25","教育培训中心危化品实训基地"]
[24,"安全环保","“红十字会”应急救援基地","现场创伤救护技术","能够掌握事故现场的止血包扎及伤员搬运操作技能，并会自救互救。","止血包扎操作技能和伤员搬运方式",4,30,"教育培训中心“红十字会”应急救援基地"]
[25,"安全环保","“红十字会”应急救援基地","心肺复苏术","能够掌握事故现场的心肺复苏、人工呼吸等自救互救的基本技能，并会操作。","心肺复苏、人工呼吸操作技能",4,30,"教育培训中心“红十字会”应急救援基地"]

{"sheet":"2024-2025学年春季学期教学进程表","index":6,"n_rows":164,"n_cols":32,"rows_kept":164,"merged":[[0,0,0,31],[1,0,2,0],[1,1,2,1],[1,2,2,2],[1,3,2,3],[1,4,2,4],[1,5,2,5],[1,7,2,7],[1,8,2,8],[1,9,1,30],[1,31,2,31],[160,27,161,31]]}
["2024-2025学年春季学期教学进程表"]
["院系名称","年级","专业班级","班级","专业","年级",null,"年级专业","人数","教学周",{"$nulls":21},"实践环节安排"]
[{"$nulls":6},"学历",null,null,0,1,2,3,4,5,6,7,8,9,10,11,12,13,14,15,16,17,18,19,20,21]
["安全工程学院","21级","安21-12","安212；安211","安全工程",2021,"本科",{"$f":"F4&G4&E4","v":"2021本科安全工程"},47,null,"×","×","×","×","×","×","×","×","×","×","×","×","×","×","×","×","×","×",{"$nulls":3},"1-18周毕业设计(论文)"]
["新材料与化工学院","21级","生物21-12","生物211；生物212","生物制药",2021,"本科","2021本科生物制药",59,null,"×","×","×","×","×","×","×","×","×","×","×","×","×","×","×","×","×","×",{"$nulls":3},"1-18周毕业设计(论文)"]
["新材料与化工学院","21级","化21-123","化211；化212；化213","化学工程与工艺",2021,"本科","2021本科化学工程与工艺",87,null,"×","×","×","×","×","×","×","×","×","×","×","×","×","×","×","×","×","×",{"$nulls":3},"1-18周毕业设计(论文)"]
["新材料与化工学院","21级","药21-123","药211；药212；药213","制药工程",2021,"本科","2021本科制药工程",89,null,"×","×","×","×","×","×","×","×","×","×","×","×","×","×","×","×","×","×",{"$nulls":3},"1-18周毕业设计(论文)"]
["新材料与化工学院","21级","高21-123","高212；高213；高211","高分子材料与工程",2021,"本科","2021本科高分子材料与工程",89,null,"×","×","×","×","×","×","×","×","×","×","×","×","×","×","×","×","×","×",{"$nulls":3},"1-18周毕业设计(论文)"]
["新材料与化工学院","21级","材211","材211","材料科学与工程",2021,"本科","2021本科材料科学与工程",24,null,"×","×","×","×","×","×","×","×","×","×","×","×","×","×","×","×","×","×",{"$nulls":3},"1-18周毕业设计(论文)"]
["新材料与化工学院","21级","化S211","化S211","化学工程与工艺(双培)",2021,"本科","2021本科化学工程与工艺(双培)",2,null,"×","×","×","×","×","×","×","×","×","×","×","×","×","×","×","×","×","×",{"$nulls":3},"1-18周毕业设计(论文)；\n化工工艺设计一周分散"]
["机械工程学院","21级","机21-12","机211；机212","机械工程",2021,"本科","2021本科机械工程",55,null,"×","×","×","×","×","×","×","×","×","×","×","×","×","×","×","×","×","×",{"$nulls":3},"1-18周毕业设计(论文)"]
["机械工程学院","21级","机电21-12","机电211；机电212","机械电子工程",2021,"本科","2021本科机械电子工程",53,null,"×","×","×","×","×","×","×","×","×","×","×","×","×","×","×","×","×","×",{"$nulls":3},"1-18周毕业设计(论文)"]
["机械工程学院","21级","能动21-123","能动211；能动212；能动213","能源与动力工程",2021,"本科","2021本科能源与动力工程",78,null,"×","×","×","×","×","×","×","×","×","×","×","×","×","×","×","×","×","×",{"$nulls":3},"1-18周毕业设计(论文)"]
["机械工程学院","21级","环21-123","环211；环212；环213","环境工程",2021,"本科","2021本科环境工程",84,null,"×","×","×","×","×","×","×","×","×","×","×","×","×","×","×","×","×","×",{"$nulls":3},"1-18周毕业设计(论文)"]
["机械工程学院","21级","新能源211","新能源211","新能源科学与工程",2021,"本科","2021本科新能源科学与工程",24,null,"×","×","×","×","×","×","×","×","×","×","×","×","×","×","×","×","×","×",{"$nulls":3},"1-18周毕业设计(论文)"]
["机械工程学院","21级","机器人211","机器人211","机器人工程",2021,"本科","2021本科机器人工程",33,null,"×","×","×","×","×","×","×","×","×","×","×","×","×","×","×","×","×","×",{"$nulls":3},"1-18周毕业设计(论文)"]
["经济管理学院","21级","营211","营211","市场营销",2021,"本科","2021本科市场营销",30,null,"×","×","×","×","×","×","×","×","×","×","×","×","×","×","×","×","×","×",{"$nulls":3},"1-18周毕业设计(论文)"]
["经济管理学院","21级","物21-12","物211；物212","物流管理",2021,"本科","2021本科物流管理",55,null,"×","×","×","×","×","×","×","×","×","×","×","×","×","×","×","×","×","×",{"$nulls":3},"1-18周毕业设计(论文)"]
["经济管理学院","21级","数管21-12","数管211；数管212","大数据管理与应用",2021,"本科","2021本科大数据管理与应用",60,null,"×","×","×","×","×","×","×","×","×","×","×","×","×","×","×","×","×","×",{"$nulls":3},"1-18周毕业设计(论文)"]
["经济管理学院","21级","会21-123","会211；会212；会213","会计学",2021,"本科","2021本科会计学",89,null,"×","×","×","×","×","×","×","×","×","×","×","×","×","×","×","×","×","×",{"$nulls":3},"1-18周毕业设计(论文)"]
["经济管理学院","21级","会214","会214","会计学(国际会计师方向)",2021,"本科","2021本科会计学(国际会计师方向)",25,null,"×","×","×","×","×","×","×","×","×","×","×","×","×","×","×","×","×","×",{"$nulls":3},"1-18周毕业设计(论文)"]
["经济管理学院","21级","国21-12","国212；国211","国际经济与贸易",2021,"本科","2021本科国际经济与贸易",56,null,"×","×","×","×","×","×","×","×","×","×","×","×","×","×","×","×","×","×",{"$nulls":3},"1-18周毕业设计(论文)"]
["经济管理学院","21级","电商211","电商211","电子商务",2021,"本科","2021本科电子商务",28,null,"×","×","×","×","×","×","×","×","×","×","×","×","×","×","×","×","×","×",{"$nulls":3},"1-18周毕业设计(论文)"]
["人文社科学院","21级","旅21-12","旅211；旅212","旅游管理",2021,"本科","2021本科旅游管理",72,null,"☆","☆","☆","☆","☆","☆","☆","☆","☆","☆","☆","☆","☆","☆","☆","☆","☆","☆",{"$nulls":3},"1-18周毕业设计(论文)\n旅游专业实习（18周分散）"]
["人文社科学院","21级","人资21-12","人资211；人资212","人力资源管理",2021,"本科","2021本科人力资源管理",47,null,"☆","☆","☆","☆","☆","☆","☆","☆","☆","☆","☆","☆","☆","☆","☆","☆","☆","☆",{"$nulls":3},"1-18周毕业设计(论文)\n专业实习（18周分散）"]
["人文社科学院","21级","会展21-12","新会展211；新会展212","会展",2021,"本科","2021本科会展",53,null,"☆","☆","☆","☆","☆","☆","☆","☆","☆","☆","☆","☆","☆","☆","☆","☆","☆","☆",{"$nulls":3},"1-18周毕业设计(论文)\n会展专业实习18周（分散）"]
["信息工程学院","21级","自21-123","自211；自212；自213","自动化",2021,"本科","2021本科自动化",90,null,"×","×","×","×","×","×","×","×","×","×","×","×","×","×","×","×","×","×",{"$nulls":3},"1-18周毕业设计(论文)\n岗位实习4周  分散"]
["信息工程学院","21级","电21-12","电212；电211","电气工程及其自动化",2021,"本科","2021本科电气工程及其自动化",60,null,"×","×","×","×","×","×","×","×","×","×","×","×","×","×","×","×","×","×",{"$nulls":3},"1-18周毕业设计(论文)\n"]
["信息工程学院","21级","计21-12","计211；计212","计算机科学与技术",2021,"本科","2021本科计算机科学与技术",68,null,"×","×","×","×","×","×","×","×","×","×","×","×","×","×","×","×","×","×",{"$nulls":3},"1-18周毕业设计(论文)；岗位实习6周（分散）"]
["信息工程学院","21级","大数据211","大数据211","数据科学与大数据技术",2021,"本科","2021本科数据科学与大数据技术",39,null,"×","×","×","×","×","×","×","×","×","×","×","×","×","×","×","×","×","×",{"$nulls":3},"1-18周毕业设计(论文)；岗位实习6周（分散）"]
["信息工程学院","21级","物联网211","物联网211","物联网工程",2021,"本科","2021本科物联网工程",26,null,"×","×","×","×","×","×","×","×","×","×","×","×","×","×","×","×","×","×",{"$nulls":3},"1-18周毕业设计(论文)\n"]
["信息工程学院","21级","大数据212","大数据212","数据科学与大数据技术(中法班)",2021,"本科","2021本科数据科学与大数据技术(中法班)",22,null,"×","×","×","×","×","×","×","×","×","×","×","×","×","×","×","×","×","×",{"$nulls":3},"1-18周毕业设计(论文)\n岗位实习6周（分散）"]
["安全工程学院","22级","安22-12","安221；安222","安全工程",2022,"本科","2022本科安全工程",48,null,"—","—","—","—","—","—","—","—","—","—","—","—","—","—","—","—","—","—","★","☆","☆","19周     职业危害与防护课程设计\n20-21周  生产实习\n         科研方法训练（1周分散）"]
["新材料与化工学院","22级","生物22-12","生物221；生物222","生物制药",2022,"本科","2022本科生物制药",60,null,"—","—","—","—","—","—","—","—","—","—","—","—","—","—","—","—","：","："]
["新材料与化工学院","22级","药22-123","药221；药222；药223","制药工程",2022,"本科","2022本科制药工程",86,null,"—","—","—","—","—","—","—","—","—","—","—","—","—","—","—","—","：","："]
["新材料与化工学院","22级","高22-123","高221；高222；高223","高分子材料与工程",2022,"本科","2022本科高分子材料与工程",69,null,"—","—","—","—","—","—","—","—","—","—","—","—","—","—","—","—","：","☆","☆","☆","☆","18-21周  专业实习"]
["新材料与化工学院","22级","材221","材221","材料科学与工程",2022,"本科","2022本科材料科学与工程",29,null,"—","—","—","—","—","—","—","—","—","—","—","—","—","—","—","—","：","☆","☆","☆","☆","18-21周  专业实习\n         科学研究方法训练（1周分散）"]
["新材料与化工学院","22级","致远221-药","致远221-药","制药工程（致远新工科实验班）",2022,"本科","2022本科制药工程（致远新工科实验班）",12,null,"—","—","—","—","—","—","—","—","—","—","—","—","—","—","—","—","：","：",{"$nulls":3},"         工程项目实践（Ⅱ）4周分散"]
["新材料与化工学院","22级","致远221-化","致远221-化","化学工程与工艺（致远新工科实验班）",2022,"本科","2022本科化学工程与工艺（致远新工科实验班）",7,null,"—","—","—","—","—","—","—","—","—","—","—","—","—","—","—","—","☆","☆","☆","☆","☆","17-21周  生产实习\n         工程项目实践（Ⅱ）3周分散"]
["新材料与化工学院","22级","致远221-高","致远221-高","高分子材料与工程（致远新工科实验班）",2022,"本科","2022本科高分子材料与工程（致远新工科实验班）",9,null,"—","—","—","—","—","—","—","—","—","—","—","—","—","—","—","—","：","☆","☆","☆","☆","18-21周  专业实习\n         工程项目实践（Ⅱ）3周分散\n"]
{"$rows_left_out":124}